Diamond App Not Install

Post Reply
maxlanechagas
Posts: 3
Joined: 09 Oct 2012, 21:41

23 Mar 2021, 18:45

When performing the installation with "npm install", it presents the following errors:


PS D:\ambienteDesenvolvimento\WORKSPACE\workspace_react\diamond-react> npm install
npm WARN deprecated request-promise-native@1.0.9: request-promise-native has been deprecated because it extends the now deprecated request package, see https://github.com/request/request/issues/3142
npm WARN deprecated @hapi/topo@3.1.6: This version has been deprecated and is no longer supported or maintained
npm WARN deprecated @hapi/bourne@1.3.2: This version has been deprecated and is no longer supported or maintained
npm WARN deprecated urix@0.1.0: Please see https://github.com/lydell/urix#deprecated
npm WARN deprecated har-validator@5.1.5: this library is no longer supported
npm WARN deprecated resolve-url@0.2.1: https://github.com/lydell/resolve-url#deprecated
npm WARN deprecated fsevents@1.2.13: fsevents 1 will break on node v14+ and could be using insecure binaries. Upgrade to fsevents 2.
npm WARN deprecated fsevents@1.2.13: fsevents 1 will break on node v14+ and could be using insecure binaries. Upgrade to fsevents 2.
npm WARN deprecated chokidar@2.1.8: Chokidar 2 will break on node v14+. Upgrade to chokidar 3 with 15x less dependencies.
npm WARN deprecated chokidar@2.1.8: Chokidar 2 will break on node v14+. Upgrade to chokidar 3 with 15x less dependencies.
npm WARN deprecated @hapi/address@2.1.4: Moved to 'npm install @sideway/address'
npm WARN deprecated babel-eslint@10.1.0: babel-eslint is now @babel/eslint-parser. This package will no longer receive updates.
npm WARN deprecated rollup-plugin-babel@4.4.0: This package has been deprecated and is no longer maintained. Please use @rollup/plugin-babel.
npm WARN deprecated request@2.88.2: request has been deprecated, see https://github.com/request/request/issues/3142
npm WARN deprecated @hapi/hoek@8.5.1: This version has been deprecated and is no longer supported or maintained
npm WARN deprecated axios@0.19.2: Critical security vulnerability fixed in v0.21.1. For more information, see https://github.com/axios/axios/pull/3410
npm WARN deprecated @hapi/joi@15.1.1: Switch to 'npm install joi'
npm WARN deprecated core-js@2.6.12: core-js@<3 is no longer maintained and not recommended for usage due to the number of issues. Please, upgrade your dependencies to the actual version of core-js@3.
npm ERR! code 1
npm ERR! path D:\ambienteDesenvolvimento\WORKSPACE\workspace_react\diamond-react\node_modules\node-sass
npm ERR! command failed
npm ERR! command C:\WINDOWS\system32\cmd.exe /d /s /c node scripts/build.js
npm ERR! Building: C:\Program Files\nodejs\node.exe D:\ambienteDesenvolvimento\WORKSPACE\workspace_react\diamond-react\node_modules\node-gyp\bin\node-gyp.js rebuild --verbose --libsass_ext= --libsass_cflags= --libsass_ldflags= --libsass_library=
npm ERR! gyp info it worked if it ends with ok
npm ERR! gyp verb cli [
npm ERR! gyp verb cli 'C:\\Program Files\\nodejs\\node.exe',
npm ERR! gyp verb cli 'D:\\ambienteDesenvolvimento\\WORKSPACE\\workspace_react\\diamond-react\\node_modules\\node-gyp\\bin\\node-gyp.js',
npm ERR! gyp verb cli 'rebuild',
npm ERR! gyp verb cli '--verbose',
npm ERR! gyp verb cli '--libsass_ext=',
npm ERR! gyp verb cli '--libsass_cflags=',
npm ERR! gyp verb cli '--libsass_ldflags=',
npm ERR! gyp verb cli '--libsass_library='
npm ERR! gyp verb cli ]
npm ERR! gyp info using node-gyp@3.8.0
npm ERR! gyp info using node@15.10.0 | win32 | x64
npm ERR! gyp verb command rebuild []
npm ERR! gyp verb command clean []
npm ERR! gyp verb clean removing "build" directory
npm ERR! gyp verb command configure []
npm ERR! gyp verb check python checking for Python executable "python2" in the PATH
npm ERR! gyp verb `which` failed Error: not found: python2
npm ERR! gyp verb `which` failed at getNotFoundError (D:\ambienteDesenvolvimento\WORKSPACE\workspace_react\diamond-react\node_modules\which\which.js:13:12)
npm ERR! gyp verb `which` failed at F (D:\ambienteDesenvolvimento\WORKSPACE\workspace_react\diamond-react\node_modules\which\which.js:68:19)
npm ERR! gyp verb `which` failed at E (D:\ambienteDesenvolvimento\WORKSPACE\workspace_react\diamond-react\node_modules\which\which.js:80:29)
npm ERR! gyp verb `which` failed at D:\ambienteDesenvolvimento\WORKSPACE\workspace_react\diamond-react\node_modules\which\which.js:89:16
npm ERR! gyp verb `which` failed at D:\ambienteDesenvolvimento\WORKSPACE\workspace_react\diamond-react\node_modules\isexe\index.js:42:5
npm ERR! gyp verb `which` failed at D:\ambienteDesenvolvimento\WORKSPACE\workspace_react\diamond-react\node_modules\isexe\windows.js:36:5
npm ERR! gyp verb `which` failed at FSReqCallback.oncomplete (node:fs:196:21)
npm ERR! gyp verb `which` failed python2 Error: not found: python2
npm ERR! gyp verb `which` failed at getNotFoundError (D:\ambienteDesenvolvimento\WORKSPACE\workspace_react\diamond-react\node_modules\which\which.js:13:12)
npm ERR! gyp verb `which` failed at F (D:\ambienteDesenvolvimento\WORKSPACE\workspace_react\diamond-react\node_modules\which\which.js:68:19)
npm ERR! gyp verb `which` failed at E (D:\ambienteDesenvolvimento\WORKSPACE\workspace_react\diamond-react\node_modules\which\which.js:80:29)
npm ERR! gyp verb `which` failed at D:\ambienteDesenvolvimento\WORKSPACE\workspace_react\diamond-react\node_modules\which\which.js:89:16
npm ERR! gyp verb `which` failed at D:\ambienteDesenvolvimento\WORKSPACE\workspace_react\diamond-react\node_modules\isexe\index.js:42:5
npm ERR! gyp verb `which` failed at D:\ambienteDesenvolvimento\WORKSPACE\workspace_react\diamond-react\node_modules\isexe\windows.js:36:5
npm ERR! gyp verb `which` failed at FSReqCallback.oncomplete (node:fs:196:21) {
npm ERR! gyp verb `which` failed code: 'ENOENT'
npm ERR! gyp verb `which` failed }
npm ERR! gyp verb check python checking for Python executable "python" in the PATH
npm ERR! gyp verb `which` failed Error: not found: python
npm ERR! gyp verb `which` failed at getNotFoundError (D:\ambienteDesenvolvimento\WORKSPACE\workspace_react\diamond-react\node_modules\which\which.js:13:12)
npm ERR! gyp verb `which` failed at F (D:\ambienteDesenvolvimento\WORKSPACE\workspace_react\diamond-react\node_modules\which\which.js:68:19)
npm ERR! gyp verb `which` failed at E (D:\ambienteDesenvolvimento\WORKSPACE\workspace_react\diamond-react\node_modules\which\which.js:80:29)
npm ERR! gyp verb `which` failed at D:\ambienteDesenvolvimento\WORKSPACE\workspace_react\diamond-react\node_modules\which\which.js:89:16
npm ERR! gyp verb `which` failed at D:\ambienteDesenvolvimento\WORKSPACE\workspace_react\diamond-react\node_modules\isexe\index.js:42:5
npm ERR! gyp verb `which` failed at D:\ambienteDesenvolvimento\WORKSPACE\workspace_react\diamond-react\node_modules\isexe\windows.js:36:5
npm ERR! gyp verb `which` failed at FSReqCallback.oncomplete (node:fs:196:21)
npm ERR! gyp verb `which` failed python Error: not found: python
npm ERR! gyp verb `which` failed at getNotFoundError (D:\ambienteDesenvolvimento\WORKSPACE\workspace_react\diamond-react\node_modules\which\which.js:13:12)
npm ERR! gyp verb `which` failed at F (D:\ambienteDesenvolvimento\WORKSPACE\workspace_react\diamond-react\node_modules\which\which.js:68:19)
npm ERR! gyp verb `which` failed at E (D:\ambienteDesenvolvimento\WORKSPACE\workspace_react\diamond-react\node_modules\which\which.js:80:29)
npm ERR! gyp verb `which` failed at D:\ambienteDesenvolvimento\WORKSPACE\workspace_react\diamond-react\node_modules\which\which.js:89:16
npm ERR! gyp verb `which` failed at D:\ambienteDesenvolvimento\WORKSPACE\workspace_react\diamond-react\node_modules\isexe\index.js:42:5
npm ERR! gyp verb `which` failed at D:\ambienteDesenvolvimento\WORKSPACE\workspace_react\diamond-react\node_modules\isexe\windows.js:36:5
npm ERR! gyp verb `which` failed at FSReqCallback.oncomplete (node:fs:196:21) {
npm ERR! gyp verb `which` failed code: 'ENOENT'
npm ERR! gyp verb `which` failed }
npm ERR! gyp verb could not find "python". checking python launcher
npm ERR! gyp verb could not find "python". guessing location
npm ERR! gyp verb ensuring that file exists: C:\Python27\python.exe
npm ERR! gyp ERR! configure error
npm ERR! gyp ERR! stack Error: Can't find Python executable "python", you can set the PYTHON env variable.
npm ERR! gyp ERR! stack at PythonFinder.failNoPython (D:\ambienteDesenvolvimento\WORKSPACE\workspace_react\diamond-react\node_modules\node-gyp\lib\configure.js:484:19)
npm ERR! gyp ERR! stack at PythonFinder.<anonymous> (D:\ambienteDesenvolvimento\WORKSPACE\workspace_react\diamond-react\node_modules\node-gyp\lib\configure.js:509:16)
npm ERR! gyp ERR! stack at callback (D:\ambienteDesenvolvimento\WORKSPACE\workspace_react\diamond-react\node_modules\graceful-fs\polyfills.js:299:20)
npm ERR! gyp ERR! stack at FSReqCallback.oncomplete (node:fs:196:21)
npm ERR! gyp ERR! System Windows_NT 10.0.19041
npm ERR! gyp ERR! command "C:\\Program Files\\nodejs\\node.exe" "D:\\ambienteDesenvolvimento\\WORKSPACE\\workspace_react\\diamond-react\\node_modules\\node-gyp\\bin\\node-gyp.js" "rebuild" "--verbose" "--libsass_ext=" "--libsass_cflags=" "--libsass_ldflags=" "--libsass_library="
npm ERR! gyp ERR! cwd D:\ambienteDesenvolvimento\WORKSPACE\workspace_react\diamond-react\node_modules\node-sass
npm ERR! gyp ERR! node -v v15.10.0
npm ERR! gyp ERR! node-gyp -v v3.8.0
npm ERR! gyp ERR! not ok
npm ERR! Build failed with error code: 1

merve7
Posts: 742
Joined: 12 Sep 2017, 10:44

26 Mar 2021, 13:07

Hi,
@can Could you please check this issue?

mcandu
Posts: 23
Joined: 20 Jan 2021, 16:31

26 Mar 2021, 13:12

Hi, Could you tell me the Diamond-React version you use ?

Post Reply

Return to “Diamond - PrimeReact”

  • Information
  • Who is online

    Users browsing this forum: No registered users and 2 guests